{"text_format":"1","workbook":"xlsx","n_sheets":9,"sheets":["À lire en premier","Rapport de contenu musical","Menus déroulants et valeurs","CisacSocietycodes","Guide de l’utilisateur","Normes et règles","z","Drop Down Menu and values","Tables"],"not_rendered":{"charts":0,"images":5,"macros":1,"external_links":0,"defined_names":3,"comments":1,"pivot_tables":0},"unopened":[],"bounds":{"document_bytes":16777216,"sheet_cells":100000,"rows_first":2000,"rows_last":500,"rows_between":2000,"halvings":0,"cell_chars":16384,"cell_head_chars":4096},"cells_cut":0,"cells_raw":0,"read":"whole","date_system":"1900"}

{"sheet":"À lire en premier","index":0,"n_rows":32,"n_cols":2,"rows_kept":32,"cut":false,"hidden":false,"merged":[[6,10,6,11],[6,12,6,13],[6,14,6,15],[6,16,6,17],[6,0,6,1],[6,2,6,3],[6,4,6,5],[6,6,6,7],[6,8,6,9],[5,10,5,11],[5,12,5,13],[5,14,5,15],[5,16,5,17],[4,0,4,1],[4,2,4,3],[4,4,4,5],[5,0,5,1],[5,2,5,3],[5,4,5,5],[5,6,5,7],[5,8,5,9],[1,12,1,13],[1,14,1,15],[4,10,4,11],[4,12,4,13],[4,14,4,15],[2,10,2,11],[2,12,2,13],[2,14,2,15],[2,16,2,17],[4,6,4,7],[4,8,4,9],[4,16,4,17],[2,0,2,1],[2,2,2,3],[2,4,2,5],[2,6,2,7],[2,8,2,9],[0,10,0,11],[0,12,0,13],[0,14,0,15],[0,16,0,17],[1,0,1,1],[1,2,1,3],[1,4,1,5],[1,6,1,7],[1,8,1,9],[0,0,0,1],[0,2,0,3],[0,4,0,5],[0,6,0,7],[0,8,0,9],[1,16,1,17],[1,10,1,11]]}
["Instructions"]
["Utilisez Microsoft Excel, sous Windows ou macOS, pour utiliser ce rapport de contenu musical (n’essayez pas de le compléter à l’aide d’un navigateur). Si vous utilisez un lecteur d’écran, utilisez NVDA ou JAWS sous Windows pour une accessibilité optimale. Voici comment :"]
["1 de 4. Ce manuel comporte trois autres feuilles de travail que la feuille de travail À lire d’abord : la feuille de travail Rapport de contenu musical dans laquelle vous saisissez vos données, suivie de conseils supplémentaires dans la feuille de travail Guide d’utilisation de haut niveau et la feuille de travail Normes et règles des rapports de contenu musical."]
["2 de 4. Si, sous Windows, vous voyez le message « Risque de sécurité : Microsoft a bloqué l’exécution des macros parce que le fichier source n’est pas fiable », allez dans l’explorateur Windows, localisez ce fichier, faites un clic droit sur le fichier, choisissez Propriétés, puis cochez la case Débloquer dans l’onglet Général.",{"$error":"#VALUE!"}]
["3 de 4. Dans la feuille de travail « Rapport de contenu musical », remplissez tous les champs de saisie pertinents (C4 à C18, C20, I4 à I18, O4 à 09), ainsi que le tableau qui commence à la ligne 28. Toutes les autres cellules sont en lecture seule, à l’exception du champ Durée de la musique assistée par ordinateur et des colonnes G et P du tableau, qui sont automatiquement remplies pour vous (elles sont toutes surlignées en jaune). N’inscrivez rien dans ces champs. Les champs obligatoires sont indiqués par un astérisque (*). "]
["4 de 4. Sauvegardez le fichier et le tour est joué."]
["Fin de la feuille de travail"]
[]
[]
[]
[]
[]
[]
[]
[]
[]
[]
[]
[]
[]
[]
[]
[]
[]
[]
[]
[]
[]
[]
[]
[]
[" "]

{"sheet":"Rapport de contenu musical","index":1,"n_rows":502,"n_cols":35,"rows_kept":502,"cut":false,"hidden":false,"merged":[[19,5,19,16],[18,5,18,10],[17,8,17,10],[10,11,15,16],[3,11,3,13],[4,11,4,13],[5,11,5,13],[6,11,6,13],[7,11,7,13],[8,11,8,13],[9,11,9,13],[14,5,14,7],[15,5,15,7],[16,5,16,7],[17,5,17,7],[12,8,12,10],[15,0,15,1],[16,0,16,1],[17,0,17,1],[18,0,18,1],[19,0,19,1],[10,0,10,1],[11,0,11,1],[12,0,12,1],[13,0,13,1],[14,0,14,1],[5,0,5,1],[6,0,6,1],[7,0,7,1],[8,0,8,1],[9,0,9,1],[0,0,0,16],[19,2,19,4],[16,11,16,16],[17,2,17,4],[17,11,17,16],[18,2,18,4],[18,11,18,16],[14,2,14,4],[14,8,14,10],[15,2,15,4],[15,8,15,10],[16,2,16,4],[16,8,16,10],[11,2,11,4],[11,8,11,10],[12,2,12,4],[13,2,13,4],[13,8,13,10],[9,2,9,4],[9,8,9,10],[9,5,9,7],[10,5,10,7],[11,5,11,7],[12,5,12,7],[13,5,13,7],[10,2,10,4],[10,8,10,10],[7,2,7,4],[7,8,7,10],[7,14,7,16],[8,2,8,4],[8,8,8,10],[8,14,8,16],[7,5,7,7],[8,5,8,7],[6,8,6,10],[6,14,6,16],[5,5,5,7],[6,5,6,7],[9,14,9,16],[501,0,501,1],[4,2,4,4],[4,8,4,10],[4,14,4,16],[1,0,2,16],[3,2,3,4],[3,8,3,10],[3,14,3,16],[3,0,3,1],[4,0,4,1],[3,5,3,7],[4,5,4,7],[5,2,5,4],[5,8,5,10],[5,14,5,16],[6,2,6,4]]}
["Rapport de contenu musical SOCAN (Les champs  marqués d’un astérisque (*) sont obligatoires)"]
["Sauvegardez une copie du rapport de contenu musical harmonisé sur votre bureau local\nNote importante : ne mettez pas à jour ce rapport de contenu musical à partir de votre navigateur car les fonctions y sont limitées"]
[]
["Classification de rapports de contenu musical :*",null,null,null,null,"Titre de la production :*",null,null,null,null,null,"Rôle de la partie AV intéressée 1 :"]
["Type de production :*",null,null,null,null,"Autres titres de la production :",null,null,null,null,null,"Nom de la partie AV intéressée 1 :"]
["Catégorie de production :*",null,null,null,null,"Titre de l’épisode :",null,null,null,null,null,"Rôle de la partie AV intéressée 2 :"]
["Date de soumission/Date de révision :*",null,null,null,null,"Autres titres de l’épisode :",null,null,null,null,null,"Nom de la partie AV intéressée 2 :"]
["Première date de parution :",null,null,null,null,"Numéro de l’épisode :",null,null,null,null,null,"Rôle de la partie AV intéressée 3 :"]
["Version :  ",null,null,null,null,"Pays de production 1 :*",null,null,null,null,null,"Nom de la partie AV intéressée 3 :"]
["Catégorie de version :",null,null,null,null,"Pays de production 2 : ",null,null,null,null,null,"Identifiant série (Utilisation interne seulement) :"]
["Commentaire sur la version :",null,null,null,null,"Pays de production 3 : ",null,null,null,null,null,"Légende"]
["Territoire/pays de la version :",null,null,null,null,"Source de l’identifiant AV :"]
["Territoire de première diffusion :",null,null,null,null,"Identifiant AV :"]
["Langue :  ",null,null,null,null,"Source de l’identifiant de production :"]
["Réseau/Station :",null,null,null,null,"Identifiant de production :"]
["Année de production :*",null,null,null,null,"Fournisseur du rapport de contenu musical :*"]
["Durée de la production :*",null,null,null,null,"Rapport de contenu musical préparé par :*",null,null,null,null,null,"Les champs  marqués d’un astérisque (*) sont obligatoires"]
["Durée totale de la musique :",null,null,null,null,"Rôle du fournisseur du rapport de contenu musical :",null,null,null,null,null,"Les cellules avec une liste déroulante sont également surlignées en orange."]
["Durée calculée  de la musique :  ",null,{"$f":"AH502","v":"00:00:00"},null,null,null,null,null,null,null,null,"Le champ de la Durée de la musique calculée ainsi que les colonnes G et P du tableau sont automatiquement peuplées pour vous (elles sont surlignées en jaune)."]
["Numéro de saison :"]
["# de séq.","Titre de la musique *","Utilisation de la musique *","Début","Fin","Durée de la musique * (HH:MM:SS)","Durée calculée de la musique (HH:MM:SS)","ISWC","ISRC","Interprètes","Source de la musique *","Rôle de la partie musicale intéressée *","Nom de la partie musicale intéressée*","Société d’affiliation","Numéro IPI","Code CISAC de la société","% de parts de la partie musicale intéressée",null,null,null,"HR","MM","SS","Time Out - Time In SS",null,null,null,"Time Out SS","Time IN ","Time Out","HH","MM","SS","Duration","Duration SS"]
[null,null,null,null,null,null,{"$f":"IF(X22<>\"\",AH22,0)","v":"00:00:00"},null,null,null,null,null,null,null,null,{"$f":"VLOOKUP(N22,CisacSocietycodes!$A$2:$C$365,2,0)","v":{"$error":"#N/A"}},null,0,0,0,{"$f":" LEFT((TEXT(AC22, \"000000\")), 2)","v":"00"},{"$f":" RIGHT(LEFT((TEXT(AC22, \"000000\")), 4), 2)","v":"00"},{"$f":" TEXT((ROUND(RIGHT((TEXT(AC22, \"000000\")), 2), 2)), \"00\")","v":"00"},{"$f":"((Y22 * 3600) + (Z22 * 60 )+( AA22 )) - ((U22 * 3600) + (V22 * 60 )+( W22 ))","v":0},{"$f":" LEFT((TEXT(AD22, \"000000\")), 2)","v":"00"},{"$f":" RIGHT(LEFT((TEXT(AD22, \"000000\")), 4), 2)","v":"00"},{"$f":" TEXT((ROUND(RIGHT((TEXT(AD22, \"000000\")), 2), 2)), \"00\")","v":"00"},{"$f":"(Y22 * 3600) + (Z22 * 60 )+( AA22 )","v":0},{"$f":"IF(F22<>\"\",0,D22)","v":0},{"$f":"IF(F22<>\"\",F22,E22)","v":0},{"$f":" ROUNDDOWN((X22/ 3600), 0)","v":0},{"$f":"ROUNDDOWN((((X22 / 3600) - AE22) * 60), 0)","v":0},{"$f":" ((X22) / 60) - (TEXT(ROUNDDOWN((X22 / 60), 0), \"00\"))","v":0},{"$f":" (TEXT(AE22, \"00\")) & \":\" &  (TEXT(AF22, \"00\")) & \":\" &  (TEXT((AG22) * 60, \"00\"))","v":"00:00:00"},{"$f":"X22","v":0}]
[null,null,null,null,null,null,{"$f":"IF(X23<>\"\",AH23,0)","v":"00:00:00"},null,null,null,null,null,null,null,null,{"$f":"VLOOKUP(N23,CisacSocietycodes!$A$2:$C$365,2,0)","v":{"$error":"#N/A"}},null,0,0,0,"00","00","00",0,"00","00","00",0,{"$f":"IF(F23<>\"\",0,D23)","v":0},0,0,0,0,"00:00:00",0]
[null,null,null,null,null,null,"00:00:00",null,null,null,null,null,null,null,null,{"$f":"VLOOKUP(N24,CisacSocietycodes!$A$2:$C$365,2,0)","v":{"$error":"#N/A"}},null,0,0,0,"00","00","00",0,"00","00","00",0,0,0,0,0,0,"00:00:00",0]
[null,null,null,null,null,null,"00:00:00",null,null,null,null,null,null,null,null,{"$f":"VLOOKUP(N25,CisacSocietycodes!$A$2:$C$365,2,0)","v":{"$error":"#N/A"}},null,0,0,0,"00","00","00",0,"00","00","00",0,0,0,0,0,0,"00:00:00",0]
[null,null,null,null,null,null,"00:00:00",null,null,null,null,null,null,null,null,{"$f":"VLOOKUP(N26,CisacSocietycodes!$A$2:$C$365,2,0)","v":{"$error":"#N/A"}},null,0,0,0,"00","00","00",0,"00","00","00",0,0,0,0,0,0,"00:00:00",0]
[null,null,null,null,null,null,"00:00:00",null,null,null,null,null,null,null,null,{"$f":"VLOOKUP(N27,CisacSocietycodes!$A$2:$C$365,2,0)","v":{"$error":"#N/A"}},null,0,0,0,"00","00","00",0,"00","00","00",0,0,0,0,0,0,"00:00:00",0]
[null,null,null,null,null,null,"00:00:00",null,null,null,null,null,null,null,null,{"$f":"VLOOKUP(N28,CisacSocietycodes!$A$2:$C$365,2,0)","v":{"$error":"#N/A"}},null,0,0,0,"00","00","00",0,"00","00","00",0,0,0,0,0,0,"00:00:00",0]
[null,null,null,null,null,null,"00:00:00",null,null,null,null,null,null,null,null,{"$f":"VLOOKUP(N29,CisacSocietycodes!$A$2:$C$365,2,0)","v":{"$error":"#N/A"}},null,0,0,0,"00","00","00",0,"00","00","00",0,0,0,0,0,0,"00:00:00",0]
[null,null,null,null,null,null,"00:00:00",null,null,null,null,null,null,null,null,{"$f":"VLOOKUP(N30,CisacSocietycodes!$A$2:$C$365,2,0)","v":{"$error":"#N/A"}},null,0,0,0,"00","00","00",0,"00","00","00",0,0,0,0,0,0,"00:00:00",0]
[null,null,null,null,null,null,"00:00:00",null,null,null,null,null,null,null,null,{"$f":"VLOOKUP(N31,CisacSocietycodes!$A$2:$C$365,2,0)","v":{"$error":"#N/A"}},null,0,0,0,"00","00","00",0,"00","00","00",0,0,0,0,0,0,"00:00:00",0]
[null,null,null,null,null,null,"00:00:00",null,null,null,null,null,null,null,null,{"$f":"VLOOKUP(N32,CisacSocietycodes!$A$2:$C$365,2,0)","v":{"$error":"#N/A"}},null,0,0,0,"00","00","00",0,"00","00","00",0,0,0,0,0,0,"00:00:00",0]
[null,null,null,null,null,null,"00:00:00",null,null,null,null,null,null,null,null,{"$f":"VLOOKUP(N33,CisacSocietycodes!$A$2:$C$365,2,0)","v":{"$error":"#N/A"}},null,0,0,0,"00","00","00",0,"00","00","00",0,0,0,0,0,0,"00:00:00",0]
[null,null,null,null,null,null,"00:00:00",null,null,null,null,null,null,null,null,{"$f":"VLOOKUP(N34,CisacSocietycodes!$A$2:$C$365,2,0)","v":{"$error":"#N/A"}},null,0,0,0,"00","00","00",0,"00","00","00",0,0,0,0,0,0,"00:00:00",0]
[null,null,null,null,null,null,"00:00:00",null,null,null,null,null,null,null,null,{"$f":"VLOOKUP(N35,CisacSocietycodes!$A$2:$C$365,2,0)","v":{"$error":"#N/A"}},null,0,0,0,"00","00","00",0,"00","00","00",0,0,0,0,0,0,"00:00:00",0]
[null,null,null,null,null,null,"00:00:00",null,null,null,null,null,null,null,null,{"$f":"VLOOKUP(N36,CisacSocietycodes!$A$2:$C$365,2,0)","v":{"$error":"#N/A"}},null,0,0,0,"00","00","00",0,"00","00","00",0,0,0,0,0,0,"00:00:00",0]
[null,null,null,null,null,null,"00:00:00",null,null,null,null,null,null,null,null,{"$f":"VLOOKUP(N37,CisacSocietycodes!$A$2:$C$365,2,0)","v":{"$error":"#N/A"}},null,0,0,0,"00","00","00",0,"00","00","00",0,0,0,0,0,0,"00:00:00",0]
[null,null,null,null,null,null,"00:00:00",null,null,null,null,null,null,null,null,{"$f":"VLOOKUP(N38,CisacSocietycodes!$A$2:$C$365,2,0)","v":{"$error":"#N/A"}},null,0,0,0,"00","00","00",0,"00","00","00",0,0,0,0,0,0,"00:00:00",0]
[null,null,null,null,null,null,"00:00:00",null,null,null,null,null,null,null,null,{"$f":"VLOOKUP(N39,CisacSocietycodes!$A$2:$C$365,2,0)","v":{"$error":"#N/A"}},null,0,0,0,"00","00","00",0,"00","00","00",0,0,0,0,0,0,"00:00:00",0]
[null,null,null,null,null,null,"00:00:00",null,null,null,null,null,null,null,null,{"$f":"VLOOKUP(N40,CisacSocietycodes!$A$2:$C$365,2,0)","v":{"$error":"#N/A"}},null,0,0,0,"00","00","00",0,"00","00","00",0,0,0,0,0,0,"00:00:00",0]
{"$rows_left_out":463}
{"sheet":"Menus déroulants et valeurs","index":2,"n_rows":1619,"n_cols":3,"rows_kept":1619,"cut":false,"hidden":true,"merged":[]}
["Menus déroulants et leurs valeurs associées du rapport de contenu musical harmonisé"]
[]
["Section supérieure du rapport de contenu musical harmonisé"]
[]
["Champ","Valeurs du menu déroulant"]
[]
["Classification de rapport de contenu musical","Original"]
[null,"Révision"]
[null,"Ébauche"]
[]
["Type de production","Pas une série"]
[null,"Série"]
[]
["Catégorie de production","Animation, dessin animé"]
[null,"Publicités télé"]
[null,"Documentaire"]
[null,"Long métrage, film commercial, téléfilm, film"]
[null,"Infopublicité, programme payant"]
[null,"Minisérie"]
[null,"Multimédia"]
[null,"Nouvelles"]
[null,"Unique, non série"]
[null,"Autre"]
[null,"Réalité"]
[null,"Télésérie, série câblée"]
[null,"Téléroman, Télévovela"]
[null,"Spéciaux"]
[null,"Événement sportif, programmation en lien avec le sport"]
[null,"Bandes-annonces"]
[]
["Version","Oui"]
[null,"Non"]
[]
["Catégorie de version","3-D"]
[null,"Ligne aérienne"]
[null,"Appli"]
[null,"Noir et blanc"]
[null,"Câble "]
[null,"Couleur"]
[null,"Version du réalisateur"]
{"$rows_left_out":1580}
{"sheet":"CisacSocietycodes","index":3,"n_rows":365,"n_cols":2,"rows_kept":365,"cut":false,"hidden":true,"merged":[]}
["Society Acronym","Society Code"]
["AACIMH",226]
["AAS",253]
["ABRAC",217]
["ABRAMUS",201]
["ABYROY",288]
["ACAM",107]
["ACCESS COPYRIGHT",210]
["ACCS",306]
["ACDAM",103]
["ACEMLA",76]
["ACS",260]
["ACUM",1]
["ADAGP",148]
["ADAVIS",230]
["ADDAF",2]
["AEI",250]
["AEI-GUATEMALA",250]
["AEPI",3]
["AGADU",4]
["AGAYC",114]
["AIPA",289]
["AKKA-LAA",122]
["AKM",5]
["ALBAUTOR",127]
["ALCS",54]
["AMAR",30]
["AMAR SOMBRÁS",30]
["AMCOS",12]
["AMPAL",162]
["AMRA",17]
["AMUS",273]
["ANACIM",218]
["ANCO",323]
["APA",15]
["APDAYC",7]
["APG-Japan",163]
["APRA",8]
["APSAV",164]
["ARGENTORES",14]
{"$rows_left_out":326}
{"sheet":"Guide de l’utilisateur","index":4,"n_rows":19,"n_cols":1,"rows_kept":19,"cut":false,"hidden":false,"merged":[[18,0,18,1]]}
["Guide l’utilisateur"]
["Les champs marqués d’un astérisque (*) sont obligatoires"]
["Les cellules avec une liste déroulante sont également surlignées en orange."]
["Notes"]
["Le numéro de séquence de chaque titre musical s’affiche automatiquement lorsque le titre musical est saisi. *NOTE* il n’est pas nécessaire d’ajouter le titre de la musique dans chaque ligne pour la même séquence d’œuvre/« cue » # "]
["La durée totale de la musique dans la partie supérieure du rapport de contenu musical est un champ libre et doit être saisie sous la forme HH:MM:SS. "]
["La durée calculée de la musique est automatiquement remplie en fonction des durées de la musique ajoutées au corps du rapport de contenu musical. "]
["La durée de la musique (colonne F) est un champ obligatoire.  "]
["Il y a 2 façons de fournir ces informations obligatoires"]
["Option 1 : utiliser les champs Début et Fin des colonnes D et E. Si vous utilisez cette option, le champ Durée calculée de la musique de la colonne G se remplira automatiquement"]
["ou"]
["Option 2 : utiliser la durée de la musique dans la colonne F – si vous utilisez cette option, le champ Durée calculée de la musique de la colonne G se remplira aussi automatiquement"]
["Exemple de la façon d’indiquer une version du rapport de contenu musical où les territoires sont exclus "]
[{"$error":"#VALUE!"}]
["Exemple de source de l’identifiant AV, Identifiant AV, Source de l'identifiant de production, Identifiant de production"]
[{"$error":"#VALUE!"}]
["Note : Lorsque vous insérez une nouvelle ligne, veuillez copier une ligne existante puis la coller en utilisant « insérer les cellules copiées ». Ce processus reportera toutes les formules et macros dans la ligne insérée."]
[{"$error":"#VALUE!"}]
["Fin de la feuille de travail"]

{"sheet":"Normes et règles","index":5,"n_rows":69,"n_cols":4,"rows_kept":69,"cut":false,"hidden":false,"merged":[[19,0,19,3],[46,0,46,3],[62,0,62,3],[12,0,12,3],[13,0,13,3],[14,0,14,3],[15,0,15,3],[16,0,16,3],[17,0,17,3],[11,0,11,3],[0,0,0,3],[1,0,1,3],[2,0,2,3],[3,0,3,3],[4,0,4,3],[5,0,5,3],[6,0,6,3],[7,0,7,3],[8,0,8,3],[9,0,9,3],[10,0,10,3]]}
["Terminologie des rapports de contenu musical"]
["Source de la musique"]
["Existant/Licencié/Indépendant :  Une œuvre musicale qui existait avant la commande de la production AV, par exemple une chanson pop lancée commercialement."]
["Musique de production/Musicothèque :  La musique de production (également connue sous le nom de musique de bibliothèque ou musicothèque) comprend une œuvre musicale et un enregistrement sonore dont les droits sont regroupés pour une synchronisation ou un doublage sous licence dans des productions audio ou audiovisuelles (des publicités télévisées ou radio aux longs métrages)."]
["Oeuvres de commande: Oeuvre musicale originale de commande écrite spécifiquement pour une production audiovisuelle, (Terminologie parfois employée par le marché américain uniquement : score ou work-for-hire.)"]
["Utilisation de la musique"]
["Thème d'ouverture (ou principal) : désigne la musique qui identifie un programme, un film ou une série au début ou à l'intérieur du programme, du film ou de la série."]
["Thème de clôture (ou de fin) : musique qui identifie un programme, un film ou une série à la fin ou à l'intérieur du programme, du film ou de la série."]
["Musique visuelle / de premier plan ou musique source : musique s’inscrivant dans l’une ou l’autre des catégories suivantes:\n(a) musique interprétée par un ou plusieurs personnages représentés à l’écran ou présentée comme parvenant aux oreilles d’un ou plusieurs personnages dans la scène présentée;\n(b) musique interprétée dans un vidéoclip\n(c) musique exécutée en rapport avec des séquences de danse chorégraphiée"]
["Musique de fond : Musique dramatique, musique de fond ou musique de partition s’entend de musique qui n’est ni un thème musical ni de la musique visuelle."]
["Indicatif musical : musique qui identifie la société de production au début et/ou à la fin d'une émission de télévision, d'un film ou d'une série télévisée et qui n'est pas un thème."]
["Type de droit"]
["Droit mécanique (reproduction) :  Le droit d’enregistrer, de reproduire et de distribuer une œuvre sur un support sonore (p. ex., fichiers numériques, CD, DVD, Blu-Ray, etc.)"]
["Droit d’exécution :  Le droit d’exécuter ou de transmettre publiquement des œuvres musicales, littéraires ou dramatiques en direct ou par le biais de médias enregistrés."]
["Droit de synchronisation :  Le droit d’inclure et de combiner une œuvre, soit complètement, soit en partie, en relation temporelle avec des œuvres ou d’autres catégories pour la création d’une production audiovisuelle, d’une œuvre multimédia ou d’une base de données."]
["Autre"]
["Domaine public :  Les œuvres du domaine public sont celles dont les droits de propriété intellectuelle ont expiré, ont été perdus ou sont inapplicables. Comme les droits varient d’un pays à l’autre, une œuvre peut être soumise à des droits dans un pays et être dans le domaine public dans un autre."]
["Éléments de données des rapports de contenu musical"]
["Libellé du champ","Valeurs","Condition \nO = obligatoire\nC = conditionnel\nF = faculatif","Description"]
["Production"]
["Type de production","Alphanumérique","O","Type d’œuvre AV, valeurs = F pour film/production unique ou S pour Série. "]
["Catégorie de production","Alphanumérique","O","Type d’œuvre AV, genre, etc"]
["Titre de la production","Alphanumérique","O","Titre de l’œuvre AV, du film, de la série ou de l’émission"]
["Titre de l’épisode ","Alphanumérique","C","Titre d’un épisode"]
["Numéro de l’épisode","Alphanumérique","C","Numéro assigné à un épisode"]
["Numéro de la saison","Alphanumérique","F","Numéro assigné à une saison"]
["Autres titres de la production","Alphanumérique","F","Tout autre titre sous lequel le film, la série ou l’émission peut être connu incluant en langue étrangère"]
["Autres titres de l’épisode","Alphanumérique","F","Tout autre titre sous lequel l’épisode peut être connu incluant en langue étrangère"]
["Langue","Alphanumérique","F","Langue de la production"]
["Durée de la production","Durée HHMMSS","O","Durée de l’œuvre AV, du programme/émission exprimée en heures, minutes et secondes"]
["Durée totale de la musique","Durée HHMMSS","F","Durée totale de la musique jouée dans l’œuvre AV, le programme ou l’émission, exprimée en heures, minutes et secondes"]
["Version","Oui/Non?","F","Indique s’il existe des versions différentes de la même œuvre AV, programme/émission"]
["Catégorie de version","Alphanumérique","C","Le type spécifique du contenu AV pour lequel l’œuvre audiovisuelle a été créée, si applicable"]
["Commentaire sur la version","Alphanumérique","C","Champ de texte ouvert pour inclure des informations supplémentaires sur la version, par exemple le nom du fournisseur de service numérique ou du diffuseur."]
["Territoire/pays de la version","Alphanumérique","C","Territoire ou pays pour lequel la version a été produite"]
["Année de production","Date AAAA","O","Année de production, l’année où la production du film ou de l’épisode d’une série a été achevée"]
["Pays de production","ISO 3133 2 \nAlpha Code","O","Pays d’origine de la société de production de l’œuvre audiovisuelle"]
["Première date de parution","Date\nAAAAMMJJ","F","Première date à laquelle l’œuvre AV a été diffusée ou exploitée. Date de première diffusion. Date de première exploitation"]
["Source de l’identifiant AV","Alphanumérique","F","Identifiants internationaux de l’œuvre AV, EIDR, ISAN, etc."]
["Identifiant AV","Alphanumérique","F","Numéro de l'identifiant AV"]
{"$rows_left_out":30}
{"sheet":"z","index":6,"n_rows":0,"n_cols":0,"rows_kept":0,"cut":false,"hidden":true,"merged":[]}

{"sheet":"Drop Down Menu and values","index":7,"n_rows":1613,"n_cols":2,"rows_kept":1613,"cut":false,"hidden":true,"merged":[]}
["Harmonized Cue sheet drop down fields and their values"]
[]
["Upper portion of the Harmonized Cue sheet"]
[]
["Field","Drop Down Values"]
[]
["Cue Sheet Classification","Original"]
[null,"Revision"]
[null,"Draft"]
[]
["Production Type","Not A Series"]
[null,"Series"]
[]
["Production Category","Animation, Cartoon"]
[null,"Commercials"]
[null,"Documentary"]
[null,"Feature Film, Theatrical, TV Movie, Movie"]
[null,"Infomercial, Paid Program"]
[null,"Mini-Series"]
[null,"Multimedia"]
[null,"News"]
[null,"One Offs, Non Series"]
[null,"Other"]
[null,"Reality"]
[null,"TV Series, Cable Series etc"]
[null,"Soap Opera, Tele-Novelas"]
[null,"Specials"]
[null,"Sporting Event, Sports Related Programme"]
[null,"Trailers"]
[]
["Version","Yes"]
[null,"No"]
[]
["Version Category","3-D"]
[null,"Airline"]
[null,"App"]
[null,"Black and White"]
[null,"Cable "]
[null,"Color"]
[null,"Director's Cut"]
{"$rows_left_out":1574}
{"sheet":"Tables","index":8,"n_rows":1004,"n_cols":3,"rows_kept":1004,"cut":false,"hidden":true,"merged":[]}
["AV Work IP Role"]
[]
["Actor"]
["Author of Screenplay"]
["Author of Sub-Titles"]
["Director"]
["Director of Photography"]
["Distributor"]
["Editor"]
["Producer"]
["Production Company"]
["Sound Engineer"]
[]
["Cue Sheet Classification"]
[]
["Original"]
["Revision"]
["Draft"]
[]
["Production Type"]
[]
["Not a Series"]
["Series"]
[]
["Cue Usage"]
[]
["Background",{"$f":"_xlfn._xlws.SORT(_xlfn._xlws.FILTER(A27:A31,ISNUMBER(SEARCH(B5,A27:A31)),\"Not Found\"))","v":"Background"}]
["Closing Theme","Closing Theme"]
["Featured/Visual","Featured/Visual"]
["Opening Theme","Logo"]
["Logo","Opening Theme"]
[]
["Origin"]
[]
["Specially Commissioned"]
["Library/Production"]
["Pre-existing"]
["Unspecified"]
[]
["Version Category"]
{"$rows_left_out":964}